Reaction Details
TargetBile acid receptor
LigandBDBM77040
Substrate/Competitorn/a
Meas. Tech.Glycocholic acid Uptake Radiometric Assay
IC50 0.16±n/a nM
Citation Gillberg, PGraffner, HStarke, I IBAT inhibitors for the treatment of liver disease US Patent US9694018 Publication Date 7/4/2017
 
Bile acid receptor
Name:Bile acid receptor
Type:Nuclear Receptor
Mol. Mass.:55916.24
Organism:Homo sapiens (Human)
Description:Q96RI1
Residue:486
BDBM77040
NameBDBM77040
Synonyms:US10093697, 5. US9694018, 5
TypeSmall organic molecule
Emp. Form.C37H48N4O8S2
Mol. Mass.740.929
SMILESCCCCC1(CCCC)CN(c2ccccc2)c2cc(SC)c(OCC(=O)N[C@@H](C(=O)N[C@@H](CC)C(O)=O)c3ccc(O)cc3)cc2S(=O)(=O)N1