Reaction Details
TargetBile acid receptor
LigandBDBM77074
Substrate/Competitorn/a
Meas. Tech.Glycocholic acid Uptake Radiometric Assay
IC50 0.20±n/a nM
Citation Gillberg, PGraffner, HStarke, I IBAT inhibitors for the treatment of liver disease US Patent US9694018 Publication Date 7/4/2017
 
Bile acid receptor
Name:Bile acid receptor
Type:Nuclear Receptor
Mol. Mass.:55916.24
Organism:Homo sapiens (Human)
Description:Q96RI1
Residue:486
BDBM77074
NameBDBM77074
Synonyms:US10093697, 10. US9694018, 10
TypeSmall organic molecule
Emp. Form.C36H46N4O7S2
Mol. Mass.710.903
SMILESCCCCC1(CCCC)CN(c2ccccc2)c2cc(SC)c(OCC(=O)N[C@@H](C(=O)N[C@@H](C)C(O)=O)c3ccccc3)cc2S(=O)(=O)N1