Reaction Details
TargetCarbonic anhydrase
LigandBDBM10865
Substrate/CompetitorBDBM10856
Meas. Tech.CA Inhibition Assay
pH8.3±n/a
Temperature293.15±n/a K
Ki 5810±n/a nM
Citation Nishimori, IMinakuchi, TVullo, DScozzafava, AInnocenti, ASupuran, CT Carbonic anhydrase inhibitors. Cloning, characterization, and inhibition studies of a new beta-carbonic anhydrase from Mycobacterium tuberculosis. J Med Chem52:3116-20 (2009) 
 
Carbonic anhydrase
Name:Carbonic anhydrase
Type:Enzyme
Mol. Mass.:69636.39
Organism:Mycobacterium tuberculosis
Description:R4ML78
Residue:655
BDBM10865
BDBM10856
NameBDBM10865
Synonyms:4-Amino-3-iodobenzenesulfonamide CHEMBL268177 halogenosulfanilamide deriv. 5e
TypeSmall organic molecule
Emp. Form.C6H7IN2O2S
Mol. Mass.298.101
SMILESNc1ccc(cc1I)S(N)(=O)=O