Reaction Details
TargetBeta-carbonic anhydrase 1
LigandBDBM10861
Substrate/CompetitorBDBM10856
Meas. Tech.CA Inhibition Assay
pH8.3±n/a
Temperature293.15±n/a K
Ki 9560±n/a nM
Citation Minakuchi, TNishimori, IVullo, DScozzafava, ASupuran, CT Molecular cloning, characterization, and inhibition studies of the Rv1284 beta-carbonic anhydrase from Mycobacterium tuberculosis with sulfonamides and a sulfamate. J Med Chem52:2226-32 (2009) 
 
Beta-carbonic anhydrase 1
Name:Beta-carbonic anhydrase 1
Type:Enzyme
Mol. Mass.:18186.06
Organism:Mycobacterium tuberculosis
Description:The recombinant GST-mtCA1 construct was cloned, expressed, and further purified from E. coli. The purified protein was used in inhibition assays.
Residue:163
BDBM10861
BDBM10856
NameBDBM10861
Synonyms:4-(2-aminoethyl)benzene-1-sulfonamide aromatic sulfonamide compound 7 | aromatic/heteroaromatic sulfonamide 6
TypeSmall organic molecule
Emp. Form.C8H12N2O2S
Mol. Mass.200.258
SMILESNCCc1ccc(cc1)S(N)(=O)=O