Reaction Details
TargetcAMP-specific 3',5'-cyclic phosphodiesterase 4D
LigandBDBM30128
Substrate/CompetitorBDBM10851
Meas. Tech.PDE4 Enzyme Assay
pH8±n/a
Temperature307.15±n/a K
Ki 2.0±n/a nM
Citation Cashman, JRVoelker, TZhang, HTO'Donnell, JM Dual inhibitors of phosphodiesterase-4 and serotonin reuptake. J Med Chem52:1530-9 (2009) 
 
cAMP-specific 3',5'-cyclic phosphodiesterase 4D
Name:cAMP-specific 3',5'-cyclic phosphodiesterase 4D
Type:Protein
Mol. Mass.:91092.69
Organism:Homo sapiens (Human)
Description:Q08499
Residue:809
BDBM30128
BDBM10851
NameBDBM30128
Synonyms:phthalazinone, 21
TypeSmall organic molecule
Emp. Form.C36H48FN3O5
Mol. Mass.621.7818
SMILESCOc1ccc(F)c(CCC2CCC(CCNCCCCCN3N=C(C4CC=CCC4C3=O)c3ccc(OC)c(OC)c3)O2)c1