Reaction Details
TargetcAMP-specific 3',5'-cyclic phosphodiesterase 4D
LigandBDBM14361
Substrate/CompetitorBDBM10851
Meas. Tech.PDE4 Enzyme Assay
pH8±n/a
Temperature307.15±n/a K
Ki 58.9±n/a nM
Citation Cashman, JRVoelker, TZhang, HTO'Donnell, JM Dual inhibitors of phosphodiesterase-4 and serotonin reuptake. J Med Chem52:1530-9 (2009) 
 
cAMP-specific 3',5'-cyclic phosphodiesterase 4D
Name:cAMP-specific 3',5'-cyclic phosphodiesterase 4D
Type:Protein
Mol. Mass.:91092.69
Organism:Homo sapiens (Human)
Description:Q08499
Residue:809
BDBM14361
BDBM10851
NameBDBM14361
Synonyms:(R,S)-Rolipram 4-[3-(cyclopentyloxy)-4-methoxyphenyl]pyrrolidin-2-one CHEMBL63 | Rolipram
TypeSmall organic molecule
Emp. Form.C16H21NO3
Mol. Mass.275.3428
SMILESCOc1ccc(cc1OC1CCCC1)C1CNC(=O)C1