Reaction Details
TargetcAMP-specific 3',5'-cyclic phosphodiesterase 4B
LigandBDBM30129
Substrate/CompetitorBDBM10851
Meas. Tech.PDE4 Enzyme Assay
pH8±n/a
Temperature307.15±n/a K
Ki 500±n/a nM
Citation Cashman, JRVoelker, TZhang, HTO'Donnell, JM Dual inhibitors of phosphodiesterase-4 and serotonin reuptake. J Med Chem52:1530-9 (2009) 
 
cAMP-specific 3',5'-cyclic phosphodiesterase 4B
Name:cAMP-specific 3',5'-cyclic phosphodiesterase 4B
Type:Protein
Mol. Mass.:83318.87
Organism:Homo sapiens (Human)
Description:Q07343
Residue:736
BDBM30129
BDBM10851
NameBDBM30129
Synonyms:phthalazinone, 22
TypeSmall organic molecule
Emp. Form.C37H50FN3O5
Mol. Mass.635.8084
SMILESCOc1ccc(F)c(CCCC2CCC(CCNCCCCCN3N=C(C4CC=CCC4C3=O)c3ccc(OC)c(OC)c3)O2)c1