Reaction Details
TargetSodium-dependent dopamine transporter
LigandBDBM30128
Substrate/CompetitorBDBM22166
Meas. Tech.Radioligand Binding Assay (Ki) and Inhibition of Substrate Uptake (EC50/IC50)
pH7.4±n/a
Temperature295.15±n/a K
Ki 2478±451 nM
EC50 3556±377 nM
Citation Cashman, JRVoelker, TZhang, HTO'Donnell, JM Dual inhibitors of phosphodiesterase-4 and serotonin reuptake. J Med Chem52:1530-9 (2009) 
 
Sodium-dependent dopamine transporter
Name:Sodium-dependent dopamine transporter
Type:Multi-pass membrane protein
Mol. Mass.:68497.11
Organism:Homo sapiens (Human)
Description:Q01959
Residue:620
BDBM30128
BDBM22166
NameBDBM30128
Synonyms:phthalazinone, 21
TypeSmall organic molecule
Emp. Form.C36H48FN3O5
Mol. Mass.621.7818
SMILESCOc1ccc(F)c(CCC2CCC(CCNCCCCCN3N=C(C4CC=CCC4C3=O)c3ccc(OC)c(OC)c3)O2)c1