Reaction Details
TargetSodium-dependent serotonin transporter
LigandBDBM30133
Substrate/CompetitorBDBM22166
Meas. Tech.Radioligand Binding Assay (Ki) and Inhibition of Substrate Uptake (EC50/IC50)
pH7.4±n/a
Temperature295.15±n/a K
Ki 21.2±4.3 nM
EC50 18.4±6.1 nM
Citation Cashman, JRVoelker, TZhang, HTO'Donnell, JM Dual inhibitors of phosphodiesterase-4 and serotonin reuptake. J Med Chem52:1530-9 (2009) 
 
Sodium-dependent serotonin transporter
Name:Sodium-dependent serotonin transporter
Type:Multi-pass membrane protein
Mol. Mass.:70322.51
Organism:Homo sapiens (Human)
Description:P31645
Residue:630
BDBM30133
BDBM22166
NameBDBM30133
Synonyms:tetrahydrofuranyl ethylamine, 24
TypeSmall organic molecule
Emp. Form.C16H24FNO2
Mol. Mass.281.3657
SMILESCNCCC1CCC(CCc2cc(F)ccc2OC)O1