Reaction Details
TargetSodium-dependent noradrenaline transporter
LigandBDBM22418
Substrate/CompetitorBDBM22166
Meas. Tech.PDE4 Enzyme Assay
Ki 1115±n/a nM
EC50 835±n/a nM
Citation Cashman, JRVoelker, TZhang, HTO'Donnell, JM Dual inhibitors of phosphodiesterase-4 and serotonin reuptake. J Med Chem52:1530-9 (2009) 
 
Sodium-dependent noradrenaline transporter
Name:Sodium-dependent noradrenaline transporter
Type:Multi-pass membrane protein
Mol. Mass.:69337.72
Organism:Homo sapiens (Human)
Description:P23975
Residue:617
BDBM22418
BDBM22166
NameBDBM22418
Synonyms:Cocaine methyl (1R,2R,3S,5S)-3-(benzoyloxy)-8-methyl-8-azabicyclo[3.2.1]octane-2-carboxylate | methyl (1R,2R,3S,5S)-8-methyl-3-[(phenylcarbonyl)oxy]-8-azabicyclo[3.2.1]octane-2-carboxylate
Typen/a
Emp. Form.C17H21NO4
Mol. Mass.303.3529
SMILES[H][C@]12CC[C@]([H])([C@H]([C@H](C1)OC(=O)c1ccccc1)C(=O)OC)N2C