Reaction Details
TargetSodium-dependent noradrenaline transporter
LigandBDBM30131
Substrate/CompetitorBDBM22166
Meas. Tech.PDE4 Enzyme Assay
Ki 2440±n/a nM
EC50 481±n/a nM
Citation Cashman, JRVoelker, TZhang, HTO'Donnell, JM Dual inhibitors of phosphodiesterase-4 and serotonin reuptake. J Med Chem52:1530-9 (2009) 
 
Sodium-dependent noradrenaline transporter
Name:Sodium-dependent noradrenaline transporter
Type:Multi-pass membrane protein
Mol. Mass.:69337.72
Organism:Homo sapiens (Human)
Description:P23975
Residue:617
BDBM30131
BDBM22166
NameBDBM30131
Synonyms:tetrahydrofuranyl ethylamine, 14
TypeSmall organic molecule
Emp. Form.C15H22FNO2
Mol. Mass.267.3391
SMILESCOc1ccc(F)cc1CCC1CCC(CCN)O1