Reaction Details
TargetGhrelin O-acyltransferase
LigandBDBM396161
Substrate/Competitorn/a
Meas. Tech.hGOAT Activity in HEK293 Cells after Incubation
IC50 0.100±n/a nM
Citation Godbout, CTrieselmann, TVintonyak, V Oxadiazolopyridine derivatives for use as ghrelin O-acyl transferase (GOAT) inhibitors US Patent US10308667 Publication Date 6/4/2019
 
Ghrelin O-acyltransferase
Name:Ghrelin O-acyltransferase
Type:Enzyme
Mol. Mass.:49733.10
Organism:Homo sapiens (Human)
Description:Q96T53
Residue:435
BDBM396161
NameBDBM396161
Synonyms:1-[6-(7-Amino-5-methyl-[1,2,5]oxadiazolo[3,4-b]pyridin-6-ylmethyl)-pyridin-2-yl]-cyclopentanecarbonitrile | US10308667, Example 64
TypeSmall organic molecule
Emp. Form.C18H18N6O
Mol. Mass.334.3751
SMILESCc1nc2nonc2c(N)c1Cc1cccc(n1)C1(CCCC1)C#N