Reaction Details
TargetGhrelin O-acyltransferase
LigandBDBM396180
Substrate/Competitorn/a
Meas. Tech.hGOAT Activity in HEK293 Cells after Incubation
IC50 0.077±n/a nM
Citation Godbout, CTrieselmann, TVintonyak, V Oxadiazolopyridine derivatives for use as ghrelin O-acyl transferase (GOAT) inhibitors US Patent US10308667 Publication Date 6/4/2019
 
Ghrelin O-acyltransferase
Name:Ghrelin O-acyltransferase
Type:Enzyme
Mol. Mass.:49733.10
Organism:Homo sapiens (Human)
Description:Q96T53
Residue:435
BDBM396180
NameBDBM396180
Synonyms:6-[5-bromo-4-(trifluoromethyl)pyrimidin-2-yl]methyl-5-methyl-[1,2,5]oxadiazolo[3,4-b]pyridin-7-amine | US10308667, Example 83
TypeSmall organic molecule
Emp. Form.C12H8BrF3N6O
Mol. Mass.389.131
SMILESCc1nc2nonc2c(N)c1Cc1ncc(Br)c(n1)C(F)(F)F