Reaction Details
TargetGhrelin O-acyltransferase
LigandBDBM396216
Substrate/Competitorn/a
Meas. Tech.hGOAT Activity in HEK293 Cells after Incubation
IC50 0.091±n/a nM
Citation Godbout, CTrieselmann, TVintonyak, V Oxadiazolopyridine derivatives for use as ghrelin O-acyl transferase (GOAT) inhibitors US Patent US10308667 Publication Date 6/4/2019
 
Ghrelin O-acyltransferase
Name:Ghrelin O-acyltransferase
Type:Enzyme
Mol. Mass.:49733.10
Organism:Homo sapiens (Human)
Description:Q96T53
Residue:435
BDBM396216
NameBDBM396216
Synonyms:6-(6-Amino-5-difluoromethoxy-pyridin-2-ylmethyl)-5-methyl-[1,2,5]oxadiazolo[3,4-b]pyridin-7-ylamine | US10308667, Example 119
TypeSmall organic molecule
Emp. Form.C13H12F2N6O2
Mol. Mass.322.2702
SMILESCc1nc2nonc2c(N)c1Cc1ccc(OC(F)F)c(N)n1