Reaction Details
TargetGhrelin O-acyltransferase
LigandBDBM396218
Substrate/Competitorn/a
Meas. Tech.hGOAT Activity in HEK293 Cells after Incubation
IC50 0.045±n/a nM
Citation Godbout, CTrieselmann, TVintonyak, V Oxadiazolopyridine derivatives for use as ghrelin O-acyl transferase (GOAT) inhibitors US Patent US10308667 Publication Date 6/4/2019
 
Ghrelin O-acyltransferase
Name:Ghrelin O-acyltransferase
Type:Enzyme
Mol. Mass.:49733.10
Organism:Homo sapiens (Human)
Description:Q96T53
Residue:435
BDBM396218
NameBDBM396218
Synonyms:6-{5-Bromo-6-[(3-methyl-oxetan-3-ylmethyl)-amino]-pyridin-2-ylmethyl}-5-methyl-[1,2,5]oxadiazolo[3,4-b]pyridin-7-ylamine | US10308667, Example 121
TypeSmall organic molecule
Emp. Form.C17H19BrN6O2
Mol. Mass.419.276
SMILESCc1nc2nonc2c(N)c1Cc1ccc(Br)c(NCC2(C)COC2)n1