Reaction Details
TargetGhrelin O-acyltransferase
LigandBDBM396219
Substrate/Competitorn/a
Meas. Tech.hGOAT Activity in HEK293 Cells after Incubation
IC50 0.033±n/a nM
Citation Godbout, CTrieselmann, TVintonyak, V Oxadiazolopyridine derivatives for use as ghrelin O-acyl transferase (GOAT) inhibitors US Patent US10308667 Publication Date 6/4/2019
 
Ghrelin O-acyltransferase
Name:Ghrelin O-acyltransferase
Type:Enzyme
Mol. Mass.:49733.10
Organism:Homo sapiens (Human)
Description:Q96T53
Residue:435
BDBM396219
NameBDBM396219
Synonyms:1-[6-(7-Amino-5-methyl-[1,2,5]oxadiazolo[3,4-b]pyridin-6-ylmethyl)-3-bromo-pyridin-2-yl]-3-methyl-azetidin-3-ol | US10308667, Example 122
TypeSmall organic molecule
Emp. Form.C16H17BrN6O2
Mol. Mass.405.249
SMILESCc1nc2nonc2c(N)c1Cc1ccc(Br)c(n1)N1CC(C)(O)C1