Reaction Details
TargetGhrelin O-acyltransferase
LigandBDBM396224
Substrate/Competitorn/a
Meas. Tech.hGOAT Activity in HEK293 Cells after Incubation
IC50 0.100±n/a nM
Citation Godbout, CTrieselmann, TVintonyak, V Oxadiazolopyridine derivatives for use as ghrelin O-acyl transferase (GOAT) inhibitors US Patent US10308667 Publication Date 6/4/2019
 
Ghrelin O-acyltransferase
Name:Ghrelin O-acyltransferase
Type:Enzyme
Mol. Mass.:49733.10
Organism:Homo sapiens (Human)
Description:Q96T53
Residue:435
BDBM396224
NameBDBM396224
Synonyms:3-[6-(7-Amino-5-methyl-[1,2,5]oxadiazolo[3,4-b]pyridin-6-ylmethyl)-3-bromo-pyridin-2-ylamino]-2,2-di methyl-propionitrile | US10308667, Example 127
TypeSmall organic molecule
Emp. Form.C17H18BrN7O
Mol. Mass.416.275
SMILESCc1nc2nonc2c(N)c1Cc1ccc(Br)c(NCC(C)(C)C#N)n1