Reaction Details
TargetGhrelin O-acyltransferase
LigandBDBM396225
Substrate/Competitorn/a
Meas. Tech.hGOAT Activity in HEK293 Cells after Incubation
IC50 0.096±n/a nM
Citation Godbout, CTrieselmann, TVintonyak, V Oxadiazolopyridine derivatives for use as ghrelin O-acyl transferase (GOAT) inhibitors US Patent US10308667 Publication Date 6/4/2019
 
Ghrelin O-acyltransferase
Name:Ghrelin O-acyltransferase
Type:Enzyme
Mol. Mass.:49733.10
Organism:Homo sapiens (Human)
Description:Q96T53
Residue:435
BDBM396225
NameBDBM396225
Synonyms:6-[5-Bromo-6-(3,3-difluoro-cyclobutylamino)-pyridin-2-ylmethyl]-5-methyl-[1,2,5]oxadiazolo[3,4-b]pyridin-7-ylamine | US10308667, Example 128
TypeSmall organic molecule
Emp. Form.C16H15BrF2N6O
Mol. Mass.425.231
SMILESCc1nc2nonc2c(N)c1Cc1ccc(Br)c(NC2CC(F)(F)C2)n1