Reaction Details
TargetAlkaline phosphatase, germ cell type
LigandBDBM396265
Substrate/Competitorn/a
Meas. Tech.Alkaline Phosphatase Assay
EC50>100±n/a nM
Citation Castro, ACGrogan, MJMcGovern, KJTremblay, MR Methods of use of cyclopamine analogs US Patent US10314827 Publication Date 6/11/2019
 
Alkaline phosphatase, germ cell type
Name:Alkaline phosphatase, germ cell type
Type:PROTEIN
Mol. Mass.:57374.31
Organism:Homo sapiens (Human)
Description:ChEMBL_29964
Residue:532
BDBM396265
NameBDBM396265
Synonyms:US10314827, Compound 1 | US10314827, Compound 9
TypeSmall organic molecule
Emp. Form.C28H43NO2
Mol. Mass.425.6465
SMILESC[C@@H]1[C@@H]2NC[C@@H](C)C[C@H]2O[C@]11CC[C@H]2[C@@H]3CC[C@@H]4CC(=O)CC[C@]4(C)[C@H]3CC2=C(C)C1