Reaction Details
TargetAlkaline phosphatase, germ cell type
LigandBDBM396283
Substrate/Competitorn/a
Meas. Tech.Alkaline Phosphatase Assay
EC50<20±n/a nM
Citation Castro, ACGrogan, MJMcGovern, KJTremblay, MR Methods of use of cyclopamine analogs US Patent US10314827 Publication Date 6/11/2019
 
Alkaline phosphatase, germ cell type
Name:Alkaline phosphatase, germ cell type
Type:PROTEIN
Mol. Mass.:57374.31
Organism:Homo sapiens (Human)
Description:ChEMBL_29964
Residue:532
BDBM396283
NameBDBM396283
Synonyms:US10314827, Compound 40
TypeSmall organic molecule
Emp. Form.C30H48N2O3
Mol. Mass.484.7137
SMILESC[C@@H]1[C@@H]2NC[C@@H](C)C[C@H]2O[C@]11CC[C@H]2[C@@H]3CC[C@@H]4C[C@H](CC[C@]4(C)[C@H]3CC2=C(C)C1)OC(=O)CN