Reaction Details
TargetMast/stem cell growth factor receptor Kit
LigandBDBM397909
Substrate/Competitorn/a
Meas. Tech.Biochemical Activity Assay
IC50<1±n/a nM
Citation DiPietro, LVHodous, BLKim, JLMiduturu, CVWenglowsky, SMWilson, DZhang, Y Compositions useful for treating disorders related to kit US Patent US9994552 Publication Date 6/12/2018
 
Mast/stem cell growth factor receptor Kit
Name:Mast/stem cell growth factor receptor Kit
Type:Protein
Mol. Mass.:109869.37
Organism:Homo sapiens (Human)
Description:P10721
Residue:976
BDBM397909
NameBDBM397909
Synonyms:US9994552, Compound 120
TypeSmall organic molecule
Emp. Form.C29H33N7O4
Mol. Mass.543.6168
SMILESCOc1cc2ncnc(N3CCN(CC3)c3ncc(Cc4ccccc4)c(=O)[nH]3)c2cc1OC[C@H]1CNCCO1