Reaction Details
TargetMast/stem cell growth factor receptor Kit
LigandBDBM397914
Substrate/Competitorn/a
Meas. Tech.Biochemical Activity Assay
IC50<1±n/a nM
Citation DiPietro, LVHodous, BLKim, JLMiduturu, CVWenglowsky, SMWilson, DZhang, Y Compositions useful for treating disorders related to kit US Patent US9994552 Publication Date 6/12/2018
 
Mast/stem cell growth factor receptor Kit
Name:Mast/stem cell growth factor receptor Kit
Type:Protein
Mol. Mass.:109869.37
Organism:Homo sapiens (Human)
Description:P10721
Residue:976
BDBM397914
NameBDBM397914
Synonyms:US9994552, Compound 125
TypeSmall organic molecule
Emp. Form.C31H38N8O2
Mol. Mass.554.6858
SMILESCOc1cc2ncnc(N3CCN(CC3)c3ncc(Cc4ccccc4)c(N)n3)c2cc1OCC1CCN(C)CC1