Reaction Details
TargetA disintegrin and metalloproteinase with thrombospondin motifs 4
LigandBDBM50337733
Substrate/Competitorn/a
Meas. Tech.Immunoblotting
IC50 1.000±n/a nM
Citation Vistnes, MChristensen, GAronsen, MLunde, IGSjaastad, ICarlson, CR Inhibitors of ADAMTS4 or ADAMTS5 for use in preventing or treating cardiac remodeling and chronic heart failure US Patent US10322143 Publication Date 6/18/2019
 
A disintegrin and metalloproteinase with thrombospondin motifs 4
Name:A disintegrin and metalloproteinase with thrombospondin motifs 4
Type:Enzyme
Mol. Mass.:90214.54
Organism:Homo sapiens (Human)
Description:O75173
Residue:837
BDBM50337733
NameBDBM50337733
Synonyms:CHEMBL1683444 US10322143, Compound 2
TypeSmall organic molecule
Emp. Form.C22H27Cl2FN4O5S
Mol. Mass.549.443
SMILESC[C@@H](C[C@@H](CS(=O)(=O)N1CCC(CC1)OCc1ccc(Cl)cc1Cl)N(O)C=O)c1ncc(F)cn1