Reaction Details
TargetP2X purinoceptor 7
LigandBDBM173376
Substrate/Competitorn/a
Meas. Tech.Ca2+ Flux assay
IC50 17.2±n/a nM
Citation Alcazar Vaca, MJAndres Gil, JILetavic, MARudolph, DAShireman, BTStenne, BMZiff, JM P2X7 Modulators US Patent US10323032 Publication Date 6/18/2019
 
P2X purinoceptor 7
Name:P2X purinoceptor 7
Type:Protein
Mol. Mass.:68602.85
Organism:Homo sapiens (Human)
Description:Q99572
Residue:595
BDBM173376
NameBDBM173376
Synonyms:US10323032, Example 89 US9604982, Example 89
TypeSmall organic molecule
Emp. Form.C19H17ClFN5O
Mol. Mass.385.823
SMILESC[C@H]1Cc2c(CN1C(=O)c1ccc(Cl)cc1F)nc(C)nc2-c1ccn[nH]1