Reaction Details
TargetProthrombin
LigandBDBM32655
Substrate/CompetitorBDBM23868
Meas. Tech.Enzyme Inhibition Assay
pH7.4±n/a
Temperature298.15±n/a K
Ki 180±30 nM
Citation Baum, BMuley, LHeine, ASmolinski, MHangauer, DKlebe, G Think twice: understanding the high potency of bis(phenyl)methane inhibitors of thrombin. J Mol Biol391:552-64 (2009) 
 
Prothrombin
Name:Prothrombin
Type:Protein
Mol. Mass.:70029.57
Organism:Homo sapiens (Human)
Description:P00734
Residue:622
BDBM32655
BDBM23868
NameBDBM32655
Synonyms:benzamidine- based compound, 4
TypeSmall organic molecule
Emp. Form.C17H25N5O2
Mol. Mass.331.4127
SMILESCC[C@@H](N)C(=O)N1CCCC1C(=O)NCc1ccc(cc1)C(N)=N