Reaction Details
TargetCarbonic anhydrase 1
LigandBDBM33274
Substrate/CompetitorBDBM10856
Meas. Tech.CA Inhibition Assay
pH7.4±n/a
Temperature298.15±n/a K
Ki 113±n/a nM
Citation Carta, FMaresca, AScozzafava, AVullo, DSupuran, CT Carbonic anhydrase inhibitors. Diazenylbenzenesulfonamides are potent and selective inhibitors of the tumor-associated isozymes IX and XII over the cytosolic isoforms I and II. Bioorg Med Chem17:7093-9 (2009) 
 
Carbonic anhydrase 1
Name:Carbonic anhydrase 1
Type:Enzyme
Mol. Mass.:28873.37
Organism:Homo sapiens (Human)
Description:P00915
Residue:261
BDBM33274
BDBM10856
NameBDBM33274
Synonyms:azo-sulfonamide, 2d
TypeSmall organic molecule
Emp. Form.C14H16N4O2S
Mol. Mass.304.367
SMILESCN(C)c1ccc(cc1)\N=N\c1cccc(c1)S(N)(=O)=O