Reaction Details
TargetCarbonic anhydrase 1
LigandBDBM33275
Substrate/CompetitorBDBM10856
Meas. Tech.CA Inhibition Assay
pH7.4±n/a
Temperature298.15±n/a K
Ki 34488±n/a nM
Citation Carta, FMaresca, AScozzafava, AVullo, DSupuran, CT Carbonic anhydrase inhibitors. Diazenylbenzenesulfonamides are potent and selective inhibitors of the tumor-associated isozymes IX and XII over the cytosolic isoforms I and II. Bioorg Med Chem17:7093-9 (2009) 
 
Carbonic anhydrase 1
Name:Carbonic anhydrase 1
Type:Enzyme
Mol. Mass.:28873.37
Organism:Homo sapiens (Human)
Description:P00915
Residue:261
BDBM33275
BDBM10856
NameBDBM33275
Synonyms:azo-sulfonamide, 2e
TypeSmall organic molecule
Emp. Form.C13H13N4O5S2
Mol. Mass.369.397
SMILESNS(=O)(=O)c1cccc(c1)\N=N\c1ccc(NCS([O-])(=O)=O)cc1