Reaction Details
TargetCarbonic anhydrase 2
LigandBDBM33273
Substrate/CompetitorBDBM10856
Meas. Tech.CA Inhibition Assay
pH7.4±n/a
Temperature298.15±n/a K
Ki 88±n/a nM
Citation Carta, FMaresca, AScozzafava, AVullo, DSupuran, CT Carbonic anhydrase inhibitors. Diazenylbenzenesulfonamides are potent and selective inhibitors of the tumor-associated isozymes IX and XII over the cytosolic isoforms I and II. Bioorg Med Chem17:7093-9 (2009) 
 
Carbonic anhydrase 2
Name:Carbonic anhydrase 2
Type:Enzyme
Mol. Mass.:29250.71
Organism:Homo sapiens (Human)
Description:P00918
Residue:260
BDBM33273
BDBM10856
NameBDBM33273
Synonyms:azo-sulfonamide, 2b
TypeSmall organic molecule
Emp. Form.C12H12N4O2S
Mol. Mass.276.314
SMILESNc1ccc(cc1)\N=N\c1cccc(c1)S(N)(=O)=O