Reaction Details
TargetCarbonic anhydrase 12
LigandBDBM33277
Substrate/CompetitorBDBM10856
Meas. Tech.CA Inhibition Assay
Ki 6250±n/a nM
Citation Carta, FMaresca, AScozzafava, AVullo, DSupuran, CT Carbonic anhydrase inhibitors. Diazenylbenzenesulfonamides are potent and selective inhibitors of the tumor-associated isozymes IX and XII over the cytosolic isoforms I and II. Bioorg Med Chem17:7093-9 (2009) 
 
Carbonic anhydrase 12
Name:Carbonic anhydrase 12
Type:Enzyme
Mol. Mass.:39456.00
Organism:Homo sapiens (Human)
Description:Catalytic domain of human cloned isozyme was used in the assay
Residue:354
BDBM33277
BDBM10856
NameBDBM33277
Synonyms:sulfonate, 3
TypeSmall organic molecule
Emp. Form.C7H8NO3S
Mol. Mass.186.209
SMILES[O-]S(=O)(=O)CNc1ccccc1