Reaction Details
TargetSortase A
LigandBDBM33302
Substrate/CompetitorBDBM33299
Meas. Tech.Fluorescence Resonance Energy Transfer (FRET) Assay
pH7.5±n/a
Temperature298.15±n/a K
IC50 20000±1600 nM
Citation Suree, NYi, SWThieu, WMarohn, MDamoiseaux, RChan, AJung, MEClubb, RT Discovery and structure-activity relationship analysis of Staphylococcus aureus sortase A inhibitors. Bioorg Med Chem17:7174-85 (2009) 
 
Sortase A
Name:Sortase A
Type:Enzyme
Mol. Mass.:23150.63
Organism:Bacillus anthracis
Description:A0A0E0VVI0
Residue:210
BDBM33302
BDBM33299
NameBDBM33302
Synonyms:rhodanine, 1-3
TypeSmall organic molecule
Emp. Form.C16H8BrN3O6S2
Mol. Mass.482.285
SMILESOc1c(Br)cc(cc1\C=C1/SC(=S)N(C1=O)c1ccc(cc1)[N+]([O-])=O)[N+]([O-])=O