Reaction Details
TargetSortase A
LigandBDBM33306
Substrate/CompetitorBDBM33299
Meas. Tech.Fluorescence Resonance Energy Transfer (FRET) Assay
pH7.5±n/a
Temperature298.15±n/a K
IC50 13000±1800 nM
Citation Suree, NYi, SWThieu, WMarohn, MDamoiseaux, RChan, AJung, MEClubb, RT Discovery and structure-activity relationship analysis of Staphylococcus aureus sortase A inhibitors. Bioorg Med Chem17:7174-85 (2009) 
 
Sortase A
Name:Sortase A
Type:Enzyme
Mol. Mass.:23150.63
Organism:Bacillus anthracis
Description:A0A0E0VVI0
Residue:210
BDBM33306
BDBM33299
NameBDBM33306
Synonyms:rhodanine, 1-7
TypeSmall organic molecule
Emp. Form.C11H7BrN2O4S2
Mol. Mass.375.218
SMILESCN1C(=S)S\C(=C/c2cc(cc(Br)c2O)[N+]([O-])=O)C1=O