Reaction Details
TargetSortase A
LigandBDBM33308
Substrate/CompetitorBDBM33299
Meas. Tech.Fluorescence Resonance Energy Transfer (FRET) Assay
pH7.5±n/a
Temperature298.15±n/a K
IC50 53000±34000 nM
Citation Suree, NYi, SWThieu, WMarohn, MDamoiseaux, RChan, AJung, MEClubb, RT Discovery and structure-activity relationship analysis of Staphylococcus aureus sortase A inhibitors. Bioorg Med Chem17:7174-85 (2009) 
 
Sortase A
Name:Sortase A
Type:Enzyme
Mol. Mass.:23150.63
Organism:Bacillus anthracis
Description:A0A0E0VVI0
Residue:210
BDBM33308
BDBM33299
NameBDBM33308
Synonyms:rhodanine, 1-9
TypeSmall organic molecule
Emp. Form.C17H15NO2S2
Mol. Mass.329.436
SMILESCCCN1C(=S)S\C(=C/c2ccc(o2)-c2ccccc2)C1=O