Reaction Details
TargetSortase A
LigandBDBM33312
Substrate/CompetitorBDBM33299
Meas. Tech.Fluorescence Resonance Energy Transfer (FRET) Assay
pH7.5±n/a
Temperature298.15±n/a K
IC50 27000±9000 nM
Citation Suree, NYi, SWThieu, WMarohn, MDamoiseaux, RChan, AJung, MEClubb, RT Discovery and structure-activity relationship analysis of Staphylococcus aureus sortase A inhibitors. Bioorg Med Chem17:7174-85 (2009) 
 
Sortase A
Name:Sortase A
Type:Enzyme
Mol. Mass.:23150.63
Organism:Bacillus anthracis
Description:A0A0E0VVI0
Residue:210
BDBM33312
BDBM33299
NameBDBM33312
Synonyms:rhodanine, 1-13
TypeSmall organic molecule
Emp. Form.C17H13NO2S2
Mol. Mass.327.421
SMILESC=CCN1C(=S)S\C(=C/c2ccc(o2)-c2ccccc2)C1=O