Reaction Details
TargetSortase A
LigandBDBM33320
Substrate/CompetitorBDBM33299
Meas. Tech.Fluorescence Resonance Energy Transfer (FRET) Assay
IC50>50000±n/a nM
Citation Suree, NYi, SWThieu, WMarohn, MDamoiseaux, RChan, AJung, MEClubb, RT Discovery and structure-activity relationship analysis of Staphylococcus aureus sortase A inhibitors. Bioorg Med Chem17:7174-85 (2009) 
 
Sortase A
Name:Sortase A
Type:Enzyme
Mol. Mass.:23150.63
Organism:Bacillus anthracis
Description:A0A0E0VVI0
Residue:210
BDBM33320
BDBM33299
NameBDBM33320
Synonyms:pyridazinone, 2-7
TypeSmall organic molecule
Emp. Form.C11H10N2O3
Mol. Mass.218.2087
SMILESCOc1c(O)cnn(-c2ccccc2)c1=O