Reaction Details
TargetSortase A
LigandBDBM33314
Substrate/CompetitorBDBM33299
Meas. Tech.Fluorescence Resonance Energy Transfer (FRET) Assay
IC50 3200±n/a nM
Citation Suree, NYi, SWThieu, WMarohn, MDamoiseaux, RChan, AJung, MEClubb, RT Discovery and structure-activity relationship analysis of Staphylococcus aureus sortase A inhibitors. Bioorg Med Chem17:7174-85 (2009) 
 
Sortase A
Name:Sortase A
Type:Enzyme
Mol. Mass.:23150.63
Organism:Bacillus anthracis
Description:A0A0E0VVI0
Residue:210
BDBM33314
BDBM33299
NameBDBM33314
Synonyms:pyridazinone, 2-1 | pyridazinone, 2-10
TypeSmall organic molecule
Emp. Form.C12H12N2O2S
Mol. Mass.248.301
SMILESCCOc1c(S)cnn(-c2ccccc2)c1=O