Reaction Details
TargetSortase A
LigandBDBM33324
Substrate/CompetitorBDBM33299
Meas. Tech.Fluorescence Resonance Energy Transfer (FRET) Assay
IC50 6700±n/a nM
Citation Suree, NYi, SWThieu, WMarohn, MDamoiseaux, RChan, AJung, MEClubb, RT Discovery and structure-activity relationship analysis of Staphylococcus aureus sortase A inhibitors. Bioorg Med Chem17:7174-85 (2009) 
 
Sortase A
Name:Sortase A
Type:Enzyme
Mol. Mass.:23150.63
Organism:Bacillus anthracis
Description:A0A0E0VVI0
Residue:210
BDBM33324
BDBM33299
NameBDBM33324
Synonyms:pyridazinone, 2-11
TypeSmall organic molecule
Emp. Form.C12H11N3O4S
Mol. Mass.293.298
SMILESCCOc1c(S)cnn(-c2ccc(cc2)[N+]([O-])=O)c1=O