Reaction Details
TargetSortase A
LigandBDBM33328
Substrate/CompetitorBDBM33299
Meas. Tech.Fluorescence Resonance Energy Transfer (FRET) Assay
IC50 14000±n/a nM
Citation Suree, NYi, SWThieu, WMarohn, MDamoiseaux, RChan, AJung, MEClubb, RT Discovery and structure-activity relationship analysis of Staphylococcus aureus sortase A inhibitors. Bioorg Med Chem17:7174-85 (2009) 
 
Sortase A
Name:Sortase A
Type:Enzyme
Mol. Mass.:23150.63
Organism:Bacillus anthracis
Description:A0A0E0VVI0
Residue:210
BDBM33328
BDBM33299
NameBDBM33328
Synonyms:pyridazinone, 2-15
TypeSmall organic molecule
Emp. Form.C12H10Cl2N2O2S
Mol. Mass.317.191
SMILESCCOc1c(S)cnn(-c2cc(Cl)cc(Cl)c2)c1=O