Reaction Details
TargetSortase A
LigandBDBM33331
Substrate/CompetitorBDBM33299
Meas. Tech.Fluorescence Resonance Energy Transfer (FRET) Assay
IC50 1200±n/a nM
Citation Suree, NYi, SWThieu, WMarohn, MDamoiseaux, RChan, AJung, MEClubb, RT Discovery and structure-activity relationship analysis of Staphylococcus aureus sortase A inhibitors. Bioorg Med Chem17:7174-85 (2009) 
 
Sortase A
Name:Sortase A
Type:Enzyme
Mol. Mass.:23150.63
Organism:Bacillus anthracis
Description:A0A0E0VVI0
Residue:210
BDBM33331
BDBM33299
NameBDBM33331
Synonyms:pyridazinone, 2-18
TypeSmall organic molecule
Emp. Form.C12H12N2O2S
Mol. Mass.248.301
SMILESCCOc1cnn(-c2ccccc2)c(=O)c1S