Reaction Details
TargetSortase A
LigandBDBM33332
Substrate/CompetitorBDBM33299
Meas. Tech.Fluorescence Resonance Energy Transfer (FRET) Assay
IC50 900±n/a nM
Citation Suree, NYi, SWThieu, WMarohn, MDamoiseaux, RChan, AJung, MEClubb, RT Discovery and structure-activity relationship analysis of Staphylococcus aureus sortase A inhibitors. Bioorg Med Chem17:7174-85 (2009) 
 
Sortase A
Name:Sortase A
Type:Enzyme
Mol. Mass.:23150.63
Organism:Bacillus anthracis
Description:A0A0E0VVI0
Residue:210
BDBM33332
BDBM33299
NameBDBM33332
Synonyms:pyridazinone, 2-19
TypeSmall organic molecule
Emp. Form.C12H11FN2O2S
Mol. Mass.266.291
SMILESCCOc1cnn(-c2cccc(F)c2)c(=O)c1S