Reaction Details
TargetSortase A
LigandBDBM33348
Substrate/CompetitorBDBM33299
Meas. Tech.Fluorescence Resonance Energy Transfer (FRET) Assay
IC50 300±n/a nM
Citation Suree, NYi, SWThieu, WMarohn, MDamoiseaux, RChan, AJung, MEClubb, RT Discovery and structure-activity relationship analysis of Staphylococcus aureus sortase A inhibitors. Bioorg Med Chem17:7174-85 (2009) 
 
Sortase A
Name:Sortase A
Type:Enzyme
Mol. Mass.:23150.63
Organism:Bacillus anthracis
Description:A0A0E0VVI0
Residue:210
BDBM33348
BDBM33299
NameBDBM33348
Synonyms:pyridazinone, 2-35
TypeSmall organic molecule
Emp. Form.C12H11ClN2O2
Mol. Mass.250.681
SMILESCCOc1cnn(-c2ccccc2)c(=O)c1Cl