Reaction Details
TargetSortase A
LigandBDBM33349
Substrate/CompetitorBDBM33299
Meas. Tech.Fluorescence Resonance Energy Transfer (FRET) Assay
IC50 247000±n/a nM
Citation Suree, NYi, SWThieu, WMarohn, MDamoiseaux, RChan, AJung, MEClubb, RT Discovery and structure-activity relationship analysis of Staphylococcus aureus sortase A inhibitors. Bioorg Med Chem17:7174-85 (2009) 
 
Sortase A
Name:Sortase A
Type:Enzyme
Mol. Mass.:23150.63
Organism:Bacillus anthracis
Description:A0A0E0VVI0
Residue:210
BDBM33349
BDBM33299
NameBDBM33349
Synonyms:pyridazinone, 2-36
TypeSmall organic molecule
Emp. Form.C12H10ClN3O4
Mol. Mass.295.679
SMILESCCOc1cnn(-c2ccc(cc2)[N+]([O-])=O)c(=O)c1Cl