Reaction Details
TargetSortase A
LigandBDBM33371
Substrate/CompetitorBDBM33299
Meas. Tech.Fluorescence Resonance Energy Transfer (FRET) Assay
IC50 1400±n/a nM
Citation Suree, NYi, SWThieu, WMarohn, MDamoiseaux, RChan, AJung, MEClubb, RT Discovery and structure-activity relationship analysis of Staphylococcus aureus sortase A inhibitors. Bioorg Med Chem17:7174-85 (2009) 
 
Sortase A
Name:Sortase A
Type:Enzyme
Mol. Mass.:23150.63
Organism:Bacillus anthracis
Description:A0A0E0VVI0
Residue:210
BDBM33371
BDBM33299
NameBDBM33371
Synonyms:pyrazolethione, 3-9
TypeSmall organic molecule
Emp. Form.C23H19N5S
Mol. Mass.397.495
SMILESCc1[nH]n(-c2ccccc2)c(=S)c1C=Nc1ccc(cc1)N=Nc1ccccc1