Reaction Details
TargetCarbonic anhydrase
LigandBDBM10855
Substrate/CompetitorBDBM10856
Meas. Tech.CA Inhibition Assay
pH8.3±n/a
Temperature293.15±n/a K
Ki 1086±n/a nM
Citation Innocenti, AHall, RASchlicker, CScozzafava, ASteegborn, CMühlschlegel, FASupuran, CT Carbonic anhydrase inhibitors. Inhibition and homology modeling studies of the fungal beta-carbonic anhydrase from Candida albicans with sulfonamides. Bioorg Med Chem17:4503-9 (2009) 
 
Carbonic anhydrase
Name:Carbonic anhydrase
Type:Enzyme
Mol. Mass.:31587.59
Organism:Candida albicans (Yeast)
Description:n/a
Residue:281
BDBM10855
BDBM10856
NameBDBM10855
Synonyms:2-aminobenzene-1-sulfonamide US10172837, 2-aminobenzenesulfonamide orthanilamide 17
TypeSmall organic molecule
Emp. Form.C6H8N2O2S
Mol. Mass.172.205
SMILESNc1ccccc1S(N)(=O)=O