Reaction Details
TargetSarcoplasmic/endoplasmic reticulum calcium ATPase 1
LigandBDBM34115
Substrate/CompetitorBDBM2
Meas. Tech.Determination of Inhibitory Potencies by Coupled ATPase Activity Assay
pH7.3±n/a
Temperature310.15±n/a K
IC50 3800±1900 nM
Citation Paula, SAbell, JDeye, JElam, CLape, MPurnell, JRatliff, RSebastian, KZultowsky, JKempton, RJ Design, synthesis, and biological evaluation of hydroquinone derivatives as novel inhibitors of the sarco/endoplasmic reticulum calcium ATPase. Bioorg Med Chem17:6613-9 (2009) 
 
Sarcoplasmic/endoplasmic reticulum calcium ATPase 1
Name:Sarcoplasmic/endoplasmic reticulum calcium ATPase 1
Type:PROTEIN
Mol. Mass.:110435.34
Organism:Oryctolagus cuniculus
Description:ChEMBL_1500621
Residue:1001
BDBM34115
BDBM2
NameBDBM34115
Synonyms:hydroquinone derivative, 3a
TypeSmall organic molecule
Emp. Form.C18H21NO4
Mol. Mass.315.3636
SMILESCCC(C)(C)c1cc(O)c(Cc2ccc(cc2)[N+]([O-])=O)cc1O