Reaction Details
TargetSarcoplasmic/endoplasmic reticulum calcium ATPase 1
LigandBDBM34121
Substrate/CompetitorBDBM2
Meas. Tech.Determination of Inhibitory Potencies by Coupled ATPase Activity Assay
pH7.3±n/a
Temperature310.15±n/a K
IC50 29000±27000 nM
Citation Paula, SAbell, JDeye, JElam, CLape, MPurnell, JRatliff, RSebastian, KZultowsky, JKempton, RJ Design, synthesis, and biological evaluation of hydroquinone derivatives as novel inhibitors of the sarco/endoplasmic reticulum calcium ATPase. Bioorg Med Chem17:6613-9 (2009) 
 
Sarcoplasmic/endoplasmic reticulum calcium ATPase 1
Name:Sarcoplasmic/endoplasmic reticulum calcium ATPase 1
Type:PROTEIN
Mol. Mass.:110435.34
Organism:Oryctolagus cuniculus
Description:ChEMBL_1500621
Residue:1001
BDBM34121
BDBM2
NameBDBM34121
Synonyms:hydroquinone derivative, 8b
TypeSmall organic molecule
Emp. Form.C23H37NO5
Mol. Mass.407.5436
SMILESCC(C)(C)OC(=O)NCCCC(=O)Oc1cc(c(O)cc1C(C)(C)C)C(C)(C)C