Reaction Details
TargetBeta-secretase 1
LigandBDBM234465
Substrate/Competitorn/a
Meas. Tech.Binding Assay
Ki 4.30±n/a nM
Citation Juhl, KMarigo, MTagmose, LJensen, T Combination treatment comprising administration of 2-amino-3,5,5-trifluoro-3,4,5,6-tetrahydropyridines US Patent US10004738 Publication Date 6/26/2018
 
Beta-secretase 1
Name:Beta-secretase 1
Type:Protein
Mol. Mass.:55755.10
Organism:Homo sapiens (Human)
Description:P56817
Residue:501
BDBM234465
NameBDBM234465
Synonyms:US10004738, 18 | US9353084, 18
TypeSmall organic molecule
Emp. Form.C21H19F4N5O
Mol. Mass.433.4021
SMILESCc1cc(cnc1C(=O)Nc1ccc(F)c(c1)[C@@]1(C)N=C(N)[C@@](C)(F)CC1(F)F)C#N