Reaction Details
TargetOrexin/Hypocretin receptor type 1
LigandBDBM401785
Substrate/Competitorn/a
Meas. Tech.FLIPR Ca2+ Flux Assay
IC50 16.2±n/a nM
Citation Liverton, NKuduk, SDBeshore, DLuo, YMeng, N Pyrazole, triazole and tetrazole orexin receptor antagonists US Patent US10010539 Publication Date 7/3/2018
 
Orexin/Hypocretin receptor type 1
Name:Orexin/Hypocretin receptor type 1
Type:Protein
Mol. Mass.:46817.55
Organism:Rattus norvegicus (Rat)
Description:P56718
Residue:416
BDBM401785
NameBDBM401785
Synonyms:US10010539, 2 | [1,1'-Biphenyl]-2-yl((2R,5R)-5-(4- (2-hydroxypropan-2-yl)-2H-1,2,3- triazol-2-yl)-2-methylpiperidin-1- yl)methanone
TypeSmall organic molecule
Emp. Form.C24H28N4O2
Mol. Mass.404.5047
SMILESC[C@@H]1CC[C@H](CN1C(=O)c1ccccc1-c1ccccc1)n1ncc(n1)C(C)(C)O