Reaction Details
TargetOrexin/Hypocretin receptor type 1
LigandBDBM401787
Substrate/Competitorn/a
Meas. Tech.FLIPR Ca2+ Flux Assay
IC50 15.9±n/a nM
Citation Liverton, NKuduk, SDBeshore, DLuo, YMeng, N Pyrazole, triazole and tetrazole orexin receptor antagonists US Patent US10010539 Publication Date 7/3/2018
 
Orexin/Hypocretin receptor type 1
Name:Orexin/Hypocretin receptor type 1
Type:Protein
Mol. Mass.:46817.55
Organism:Rattus norvegicus (Rat)
Description:P56718
Residue:416
BDBM401787
NameBDBM401787
Synonyms:((2R,5R)-5-(4-(2-Hydroxypropan-2- yl)-2H-1,2,3-triazol-2-yl)-2- methylpiperidin-1-yl)(2- propylphenyl)methanone | US10010539, 4
TypeSmall organic molecule
Emp. Form.C21H30N4O2
Mol. Mass.370.4885
SMILESCCCc1ccccc1C(=O)N1C[C@@H](CC[C@H]1C)n1ncc(n1)C(C)(C)O