Reaction Details
TargetOrexin/Hypocretin receptor type 1
LigandBDBM401793
Substrate/Competitorn/a
Meas. Tech.FLIPR Ca2+ Flux Assay
IC50 26.0±n/a nM
Citation Liverton, NKuduk, SDBeshore, DLuo, YMeng, N Pyrazole, triazole and tetrazole orexin receptor antagonists US Patent US10010539 Publication Date 7/3/2018
 
Orexin/Hypocretin receptor type 1
Name:Orexin/Hypocretin receptor type 1
Type:Protein
Mol. Mass.:46817.55
Organism:Rattus norvegicus (Rat)
Description:P56718
Residue:416
BDBM401793
NameBDBM401793
Synonyms:((2R,5R)-5-(4-(2-Hydroxypropan-2- yl)-2H-1,2,3-triazol-2-yl)-2- methylpiperidin-1-yl)(2-(4-methyl- 1H-pyrazol-1-yl)pyridin-3- yl)methanone | US10010539, 10
TypeSmall organic molecule
Emp. Form.C21H27N7O2
Mol. Mass.409.4848
SMILESC[C@@H]1CC[C@H](CN1C(=O)c1cccnc1-n1cc(C)cn1)n1ncc(n1)C(C)(C)O