Reaction Details
TargetOrexin/Hypocretin receptor type 1
LigandBDBM401794
Substrate/Competitorn/a
Meas. Tech.FLIPR Ca2+ Flux Assay
IC50 20.0±n/a nM
Citation Liverton, NKuduk, SDBeshore, DLuo, YMeng, N Pyrazole, triazole and tetrazole orexin receptor antagonists US Patent US10010539 Publication Date 7/3/2018
 
Orexin/Hypocretin receptor type 1
Name:Orexin/Hypocretin receptor type 1
Type:Protein
Mol. Mass.:46817.55
Organism:Rattus norvegicus (Rat)
Description:P56718
Residue:416
BDBM401794
NameBDBM401794
Synonyms:2-{2-[(3R,6R)-6-Methyl-1-({2- [(trifluoromethyl)sulfanyl]pheny} carbonyl)piperidin-3-yl]-2H-1,2,3- triazol-4-yl}propan-2-ol | US10010539, 11
TypeSmall organic molecule
Emp. Form.C19H23F3N4O2S
Mol. Mass.428.472
SMILESC[C@@H]1CC[C@H](CN1C(=O)c1ccccc1SC(F)(F)F)n1ncc(n1)C(C)(C)O